{"text_format":"1","workbook":"xlsx","n_sheets":8,"sheets":["Allgemeines Garten","Kleinstrukturen","Moose","Flechten","Artenliste","Artenliste_M","Substrat","Substrat_M"],"not_rendered":{"charts":0,"images":1,"macros":1,"external_links":4,"defined_names":12,"comments":0,"pivot_tables":0},"unopened":[],"bounds":{"document_bytes":16777216,"sheet_cells":100000,"rows_first":2000,"rows_last":500,"rows_between":2000,"halvings":0,"cell_chars":16384,"cell_head_chars":4096},"cells_cut":0,"cells_raw":0,"read":"whole","date_system":"1900"}

{"sheet":"Allgemeines Garten","index":0,"n_rows":30,"n_cols":2,"rows_kept":30,"cut":false,"hidden":false,"merged":[[24,0,24,2],[18,0,18,1],[6,1,6,2],[0,0,0,2],[2,0,2,2],[3,1,3,2],[4,1,4,2],[5,1,5,2],[19,0,19,2],[27,0,27,2],[29,0,29,2],[26,0,26,2],[7,0,8,0],[9,1,9,2],[12,1,12,2],[13,1,13,2],[14,1,14,2],[16,0,16,2],[11,0,11,2],[21,0,21,1],[23,0,23,1],[25,0,25,1],[17,0,17,1],[20,0,20,1],[22,0,22,2]]}
["Moose und Flechten in Gärten - allg. Angaben zum Garten"]
[]
["Adresse des Garten"]
["Strassenname"]
["Hausnummer"]
["Gemeinde"]
["Kanton"]
["Schweizerkoordinaten des ungefähren Zentrums des Grundstücks\n(LV 95; siebenstellig, siehe map.geo.admin.ch) ","West-Ost\n(z.B. 2683000 für den Hauptbahnhof Zürich)"]
[null,"Süd-Nord\n(z.B. 1248115 für den Hauptbahnhof Zürich)"]
["Fläche des Gartens [m2]\n(siehe Anleitung)"]
[]
["Wem gehört das Grundstück?"]
["Namen, Vornamen der EigentümerInnen des Grundstücks"]
["Kontaktadresse"]
["Email\n(wenn möglich, nicht zwingend)"]
[]
["Zur Geschichte & Pflege des Gartens"]
["Wann wurde das Haus gebaut?  [Jahreszahl]"]
["Wurden in den vergangenen Jahren grössere Umgestaltungen (> 30% der Fläche) durchgeführt? [ja/nein]"]
["[wenn ja, ist der Zeipunkt bekannt?]"]
["Seit wann wird der Garten von den gleichen Personen gepflegt? [Jahreszahl]"]
["Werden Moose und Flechten im untersuchten Garten aktiv bekämpft (z.B. Vertikutieren des Rasens, Pflege von Steinplatten mit einem Hochdruckreiniger, Jäten von Fugen zwischen Platten etc.?  [ja/nein]"]
["[wenn ja, bitte kurze Beschreibung der Massnahmen]"]
["Werden Pestizide (Herbizide, Fungizide, Insektizide etc.) verwendet? [ja/nein]"]
["[wenn ja, bitte kurze Beschreibung der Art  und des Einsatzes der verwendeten Mittel]"]
["Werden Düngemittel ausgebracht (z.B. Kompost, Mist, Mineraldünger etc.) ? [ja/nein]"]
["[wenn ja, bitte kurze Beschreibung der Art und des Einsatzes des Düngers]"]
["Bemerkungen zum Garten"]
[]
["Bitte den Garten mit ein paar Fotos dokumentieren :-)"]

{"sheet":"Kleinstrukturen","index":1,"n_rows":137,"n_cols":4,"rows_kept":137,"cut":false,"hidden":false,"merged":[[0,0,0,3],[2,0,2,3],[22,0,22,3]]}
["Moose und Flechten in Gärten - Kleinstrukturen im Garten"]
[]
["Ziel: grobe, standardisierte Beschreibung der strukturellen Vielfalt des Gartens\n\nVorgehen:\n(1) sind die, in der Liste aufgeführten Strukturelemente im Garten vorhanden?\n(2) grobe Schätzung der Fläche der vorhandenen Strukturelementen in Quadratmetern. Bei Bäumen/Sträuchern wird die Fläche, die durch die Krone abgedeckt wird (Projektion auf den Boden) geschätzt. Bei senkrechten Flächen wie z.B. Mauern wird die Fläche der Mauer geschätzt (Mauern des Wohnhauses werden nicht berücksichtigt)."]
[]
["Struktur","vorhanden?\n[ja/nein]","Fläche\n[m2]","Anmerkung"]
["Rasen\n(Grasfläche mit häufigem Schnitt; Vegetation kaum je über 15 cm hoch; inkl. stark vermooste Bereiche)"]
["Wiese / Blumenwiese\n(Grasfläche, die selten geschnitten wird; Vegetation ausser nach dem Schnitt über 15 cm hoch)"]
["Gemüsebeete, Kräuterbeete, Beerenkulturen"]
["Blumenbeete, Rabatten mit Stauden oder Rosen"]
["Bodendecker\n(Cotoneaster, Immergrün, Efeu etc.)"]
["Kleingehölze\n(niedriger als 3 m)"]
["Grossgehölze\n(höher als 3 m)"]
["Unversiegelter Bodenbelag\n(z.B. Kies- oder Sandplätze, Wege, Sitzplätze oder Parkplätze aus Steinplatten mit wasserdurchlässigen Fugen)"]
["Versiegelter Bodenbelag\n(keine oder wasserundurchlässige Fuge, z.B. Wege, Abstellplätze, Parkplätze aus Teer, Beton etc.)"]
["Wasserflächen\n(Teiche, Bächlein, Brunnen etc.)"]
["Verwilderte, aufgelassene Bereiche\n(mind. 1 Jahr nicht gepflegt, z.B. ungepflegtes Bord hinter dem Haus)"]
["Elemente aus Gestein\n(Trockenmauern, Mauern mit Mörtel in den Fugen, Betonmauern, Drahtschotterkörbe, Einfassungen von Rabatten / Wegen, Steinhaufen, Steingärten, Alpinum, Granitstelen, Felsen, Steinblöcke, Findlinge etc.\nHausmauern und Hausdächer werden nicht aufgenommen)"]
["Totholz\n(Strünke oder Stämme, Ø mind. 8 cm; keine Unterscheidung zwischen Holzkörper und Rinde)"]
["Bearbeitetes Holz\n(z.B. Holzzäune, Holzgeländer, Holzbänke, Holzpalisaden)"]
["Metall & Plastik\n(Metalzäune, Metallgeländer, Metallgitter, Dolendeckel, Skulpturen, Plastikplanen etc.)"]
["Kleine Gebäude\n(z.B. Gartenhäuschen, Spielhäuschen, Velounterstand, Pergola, Schöpflein, gedeckter Sitzplatz etc.)"]
[]
["Allg. Anmerkungen zu Strukturen im Garten"]
[]
[]
[]
[]
[]
[]
[]
[]
[]
[]
[]
[]
[]
[]
[]
[]
[]
[]
[]
[]
[]
[]
[]
[]
[]
[]
[]
[]
[]
[]
[]
[]
[]
[]
[]
[]
[]
{"$rows_left_out":78}
{"sheet":"Moose","index":2,"n_rows":9,"n_cols":4,"rows_kept":9,"cut":false,"hidden":false,"merged":[[4,1,4,3],[5,1,5,3],[6,1,6,3],[0,0,0,3],[2,1,2,3],[3,1,3,3]]}
["Moose und Flechten in Gärten - Artenliste Moose"]
[]
["Koordinaten des Zentrums des Gartens","                                                       /"]
["Datum der Erhebung im Garten"]
["Wieviel Zeit wurde für die Kartierung der Moose im Garten benötigt? [Min.]"]
["Namen der KartiereInnen"]
["Namen der BestimmerInnen der gesammelten Belege"]
[]
["Artname","Substrat","Beleg\n[ja/nein]","Belegnummer\n(falls vorhanden)"]

{"sheet":"Flechten","index":3,"n_rows":31,"n_cols":13,"rows_kept":31,"cut":false,"hidden":false,"merged":[[6,1,6,3],[0,0,0,3],[2,1,2,3],[3,1,3,3],[4,1,4,3],[5,1,5,3]]}
["Moose und Flechten in Gärten - Artenliste Flechten"]
[]
["Koordinaten des Zentrums des Gartens","                                                       /"]
["Datum der Erhebung im Garten"]
["Wieviel Zeit wurde für die Kartierung der Flechten im Garten benötigt? [Min.]"]
["Namen der KartiereInnen"]
["Namen der BestimmerInnen der gesammelten Belege"]
[]
["Artname","Substrat","Beleg\n[ja/nein]","Belegnummer\n(falls vorhanden)",null,null,null,null,null,null,null,"DB Code Art","DB Code Substrat"]
["","",null,null,null,null,null,null,null,null,null,{"$f":"VLOOKUP(A10, Artenliste!$A$3:$B$2635, 2, TRUE)","v":{"$error":"#N/A"}},{"$f":"VLOOKUP(B10, Substrat!$A$2:$F$340, 2, FALSE)","v":{"$error":"#N/A"}}]
[null,null,null,null,null,null,null,null,null,null,null,{"$f":"VLOOKUP(A11, Artenliste!$A$3:$B$2635, 2, TRUE)","v":{"$error":"#N/A"}},{"$f":"VLOOKUP(B11, Substrat!$A$2:$F$340, 2, FALSE)","v":{"$error":"#N/A"}}]
[null,null,null,null,null,null,null,null,null,null,null,{"$f":"VLOOKUP(A12, Artenliste!$A$3:$B$2635, 2, TRUE)","v":{"$error":"#N/A"}},{"$f":"VLOOKUP(B12, Substrat!$A$2:$F$340, 2, FALSE)","v":{"$error":"#N/A"}}]
[null,null,null,null,null,null,null,null,null,null,null,{"$f":"VLOOKUP(A13, Artenliste!$A$3:$B$2635, 2, TRUE)","v":{"$error":"#N/A"}},{"$f":"VLOOKUP(B13, Substrat!$A$2:$F$340, 2, FALSE)","v":{"$error":"#N/A"}}]
[null,null,null,null,null,null,null,null,null,null,null,{"$f":"VLOOKUP(A14, Artenliste!$A$3:$B$2635, 2, TRUE)","v":{"$error":"#N/A"}},{"$f":"VLOOKUP(B14, Substrat!$A$2:$F$340, 2, FALSE)","v":{"$error":"#N/A"}}]
[null,null,null,null,null,null,null,null,null,null,null,{"$f":"VLOOKUP(A15, Artenliste!$A$3:$B$2635, 2, TRUE)","v":{"$error":"#N/A"}},{"$f":"VLOOKUP(B15, Substrat!$A$2:$F$340, 2, FALSE)","v":{"$error":"#N/A"}}]
[null,null,null,null,null,null,null,null,null,null,null,{"$f":"VLOOKUP(A16, Artenliste!$A$3:$B$2635, 2, TRUE)","v":{"$error":"#N/A"}},{"$f":"VLOOKUP(B16, Substrat!$A$2:$F$340, 2, FALSE)","v":{"$error":"#N/A"}}]
[null,null,null,null,null,null,null,null,null,null,null,{"$f":"VLOOKUP(A17, Artenliste!$A$3:$B$2635, 2, TRUE)","v":{"$error":"#N/A"}},{"$f":"VLOOKUP(B17, Substrat!$A$2:$F$340, 2, FALSE)","v":{"$error":"#N/A"}}]
[null,null,null,null,null,null,null,null,null,null,null,{"$f":"VLOOKUP(A18, Artenliste!$A$3:$B$2635, 2, TRUE)","v":{"$error":"#N/A"}},{"$f":"VLOOKUP(B18, Substrat!$A$2:$F$340, 2, FALSE)","v":{"$error":"#N/A"}}]
[null,null,null,null,null,null,null,null,null,null,null,{"$f":"VLOOKUP(A19, Artenliste!$A$3:$B$2635, 2, TRUE)","v":{"$error":"#N/A"}},{"$f":"VLOOKUP(B19, Substrat!$A$2:$F$340, 2, FALSE)","v":{"$error":"#N/A"}}]
[null,null,null,null,null,null,null,null,null,null,null,{"$f":"VLOOKUP(A20, Artenliste!$A$3:$B$2635, 2, TRUE)","v":{"$error":"#N/A"}},{"$f":"VLOOKUP(B20, Substrat!$A$2:$F$340, 2, FALSE)","v":{"$error":"#N/A"}}]
[null,null,null,null,null,null,null,null,null,null,null,{"$f":"VLOOKUP(A21, Artenliste!$A$3:$B$2635, 2, TRUE)","v":{"$error":"#N/A"}},{"$f":"VLOOKUP(B21, Substrat!$A$2:$F$340, 2, FALSE)","v":{"$error":"#N/A"}}]
[null,null,null,null,null,null,null,null,null,null,null,{"$f":"VLOOKUP(A22, Artenliste!$A$3:$B$2635, 2, TRUE)","v":{"$error":"#N/A"}},{"$f":"VLOOKUP(B22, Substrat!$A$2:$F$340, 2, FALSE)","v":{"$error":"#N/A"}}]
[null,null,null,null,null,null,null,null,null,null,null,{"$f":"VLOOKUP(A23, Artenliste!$A$3:$B$2635, 2, TRUE)","v":{"$error":"#N/A"}},{"$f":"VLOOKUP(B23, Substrat!$A$2:$F$340, 2, FALSE)","v":{"$error":"#N/A"}}]
[null,null,null,null,null,null,null,null,null,null,null,{"$f":"VLOOKUP(A24, Artenliste!$A$3:$B$2635, 2, TRUE)","v":{"$error":"#N/A"}},{"$f":"VLOOKUP(B24, Substrat!$A$2:$F$340, 2, FALSE)","v":{"$error":"#N/A"}}]
[null,null,null,null,null,null,null,null,null,null,null,{"$f":"VLOOKUP(A25, Artenliste!$A$3:$B$2635, 2, TRUE)","v":{"$error":"#N/A"}},{"$f":"VLOOKUP(B25, Substrat!$A$2:$F$340, 2, FALSE)","v":{"$error":"#N/A"}}]
[null,null,null,null,null,null,null,null,null,null,null,{"$f":"VLOOKUP(A26, Artenliste!$A$3:$B$2635, 2, TRUE)","v":{"$error":"#N/A"}},{"$f":"VLOOKUP(B26, Substrat!$A$2:$F$340, 2, FALSE)","v":{"$error":"#N/A"}}]
[null,null,null,null,null,null,null,null,null,null,null,{"$f":"VLOOKUP(A27, Artenliste!$A$3:$B$2635, 2, TRUE)","v":{"$error":"#N/A"}},{"$f":"VLOOKUP(B27, Substrat!$A$2:$F$340, 2, FALSE)","v":{"$error":"#N/A"}}]
[null,null,null,null,null,null,null,null,null,null,null,{"$f":"VLOOKUP(A28, Artenliste!$A$3:$B$2635, 2, TRUE)","v":{"$error":"#N/A"}},{"$f":"VLOOKUP(B28, Substrat!$A$2:$F$340, 2, FALSE)","v":{"$error":"#N/A"}}]
[null,null,null,null,null,null,null,null,null,null,null,{"$f":"VLOOKUP(A29, Artenliste!$A$3:$B$2635, 2, TRUE)","v":{"$error":"#N/A"}},{"$f":"VLOOKUP(B29, Substrat!$A$2:$F$340, 2, FALSE)","v":{"$error":"#N/A"}}]
[null,null,null,null,null,null,null,null,null,null,null,{"$f":"VLOOKUP(A30, Artenliste!$A$3:$B$2635, 2, TRUE)","v":{"$error":"#N/A"}},{"$f":"VLOOKUP(B30, Substrat!$A$2:$F$340, 2, FALSE)","v":{"$error":"#N/A"}}]
[null,null,null,null,null,null,null,null,null,null,null,{"$f":"VLOOKUP(A31, Artenliste!$A$3:$B$2635, 2, TRUE)","v":{"$error":"#N/A"}},{"$f":"VLOOKUP(B31, Substrat!$A$2:$F$340, 2, FALSE)","v":{"$error":"#N/A"}}]

{"sheet":"Artenliste","index":4,"n_rows":2635,"n_cols":2,"rows_kept":2635,"cut":false,"hidden":false,"merged":[]}
["FlorApp_neue Version"]
["Liart_Species","Liart_code"]
["Absconditella",5003]
["Absconditella annexa (Arnold) Vezda",1541]
["Absconditella delutula (Nyl.) Coppins & H. Kilias",1535]
["Absconditella lignicola Vezda & Pisút",8000]
["Absconditella pauxilla Vezda & Vivant",1540]
["Acarospora",5004]
["Acarospora admissa (Nyl.) Kullh.",22044]
["Acarospora albomarginata (H. Magn.) Clauzade & Cl. Roux",21527]
["Acarospora badiofusca (Nyl.) Th. Fr. s.lat.",2914]
["Acarospora badiofusca (Nyl.) Th. Fr. subsp. badiofusca ","25000"]
["Acarospora badiofusca (Nyl.) Th. Fr. subsp. badiorubra Clauzade & Cl. Roux","1802"]
["Acarospora bullata Anzi",29]
["Acarospora chrysocardia Poelt & M. Steiner",7]
["Acarospora cinerascens J. Steiner",20368]
["Acarospora commixta H. Magn.",20731]
["Acarospora complanata H. Magn.",1808]
["Acarospora discreta (Ach.) Th. Fr.",22090]
["Acarospora freyi H. Magn.",20767]
["Acarospora fuscata (Schrad.) Arnold",10]
["Acarospora gallica H. Magn.",1544]
["Acarospora glaucocarpa (Ach.) Körb.",11]
["Acarospora heufleriana Körb.",6]
["Acarospora hospitans H. Magn.",1590]
["Acarospora imbricatula H. Magn.",20513]
["Acarospora impressula Th. Fr.",2915]
["Acarospora insolata H. Magn.","1594"]
["Acarospora laqueata Stizenb.",21423]
["Acarospora macrospora (Hepp)  A. Massal. ex Bagl.",14]
["Acarospora melaplaca (Nyl.) Arnold",1574]
["Acarospora modenensis H. Magn.",20737]
["Acarospora moenium (Vain.) Räsänen",4560]
["Acarospora murorum A. Massal.",1563]
["Acarospora nitrophila H. Magn. s. lat.",130]
["Acarospora nitrophila H. Magn. subsp. nitrophila ",25001]
["Acarospora nitrophila H. Magn. subsp. normanii (H. Magn.) Clauzade & Cl. Roux",25002]
["Acarospora nitrophila H. Magn. subsp. praeruptorum (H. Magn.) Clauzade & Cl. Roux",1812]
["Acarospora nodulosa (Dufour) Hue s. lat.",8004]
["Acarospora nodulosa (Dufour) Hue var. nodulosa ",1545]
["Acarospora nodulosa (Dufour) Hue var. reagens (Zahlbr.) Clauzade & Cl. Roux",1546]
["Acarospora oligospora (Nyl.) Arnold",1561]
["Acarospora peliscypha Th. Fr.",1542]
["Acarospora rugulosa Körb.","4967"]
["Acarospora schleicheri\n (Ach.) A. Massal.",20]
["Acarospora similis H. Magn.",20732]
["Acarospora sinopica (Wahlenb.) Körb.",24]
["Acarospora tongletii (Hue) Hue s.lat.","25003"]
["Acarospora tongletii (Hue) Hue var. paupera (H. Magn.) Clauzade & Cl. Roux",1571]
["Acarospora tongletii (Hue) Hue var. tongletii ","1566"]
["Acarospora umbilicata Bagl.",31]
["Acarospora valdobbiensis  Bagl. & Carestia",22034]
["Acarospora veronensis A. Massal.",30]
["Acarospora versicolor Bagl. & Carestia",1578]
["Acolium inquinans (Sm.) A. Massal.",474]
["Acolium karelicum (Vain.) M. Prieto & Wedin",3199]
["Acolium sessile (Pers.) Arnold",2223]
["Acrocordia",5006]
["Acrocordia cavata (Ach.) R. C. Harris",32]
["Acrocordia conoidea (Fr.) Körb. s. lat. ",33]
{"$rows_left_out":2576}
{"sheet":"Artenliste_M","index":5,"n_rows":1606,"n_cols":3,"rows_kept":1606,"cut":false,"hidden":false,"merged":[]}
["infoflora_taxon_id","Rang","Taxonname"]
[85001,"genus","Anthoceros L."]
[85002,"aggr","Anthoceros punctatus aggr."]
[85003,"sp","Anthoceros agrestis Paton"]
[85004,"sp","Anthoceros punctatus L."]
[85005,"genus","Phaeoceros Prosk."]
[85006,"sp","Phaeoceros laevis (L.) Prosk."]
[85007,"subsp","Phaeoceros laevis subsp. carolinianus (Michx.) Prosk."]
[85147,"genus","Haplomitrium Nees, nom. cons."]
[85148,"sp","Haplomitrium hookeri (Sm.) Nees"]
[85392,"genus","Syzygiella Spruce"]
[85393,"sp","Syzygiella autumnalis (DC.) K.Feldberg & al."]
[85066,"genus","Cephalozia (Dumort.) Dumort."]
[86612,"sp","Cephalozia albescens (Hook.) Dumort."]
[85067,"sp","Cephalozia catenulata (Huebener) Lindb."]
[85068,"subsp","Cephalozia catenulata (Huebener) Lindb. subsp. catenulata"]
[85069,"sp","Cephalozia connivens (Dicks.) Lindb."]
[85070,"subsp","Cephalozia connivens (Dicks.) Lindb. subsp. connivens"]
[86617,"sp","Cephalozia curvifolia (Dicks.) Dumort."]
[85071,"sp","Cephalozia leucantha Spruce"]
[85072,"sp","Cephalozia loitlesbergeri Schiffn."]
[85073,"sp","Cephalozia lunulifolia (Dumort.) Dumort."]
[85074,"sp","Cephalozia macrostachya Kaal."]
[85075,"subsp","Cephalozia macrostachya Kaal. subsp. macrostachya"]
[85076,"sp","Cephalozia pleniceps (Austin) Lindb."]
[85077,"aggr","Cephalozia bicuspidata aggr."]
[85078,"sp","Cephalozia ambigua C.Massal."]
[85079,"sp","Cephalozia bicuspidata (L.) Dumort."]
[85262,"genus","Odontoschisma (Dumort.) Dumort."]
[85263,"sp","Odontoschisma denudatum (Mart.) Dumort."]
[86599,"subsp","Odontoschisma denudatum (Mart.) Dumort. subsp. denudatum"]
[85264,"sp","Odontoschisma elongatum (Lindb.) A.Evans"]
[86616,"sp","Odontoschisma fluitans (Nees) L.Söderstr. & Váňa"]
[86623,"sp","Odontoschisma francisci (Hook.) L.Söderstr. & Váňa"]
[85265,"sp","Odontoschisma macounii (Austin) Underw."]
[85266,"sp","Odontoschisma sphagni (Dicks.) Dumort."]
[85154,"genus","Hygrobiella Spruce"]
[85155,"sp","Hygrobiella laxifolia (Hook.) Spruce"]
[85080,"genus","Cephaloziella (Spruce) Schiffn., nom. cons."]
[85081,"sp","Cephaloziella divaricata (Sm.) Schiffn."]
[85082,"sp","Cephaloziella elachista (Gottsche & Rabenh.) Schiffn."]
[85083,"sp","Cephaloziella grimsulana (Gottsche & Rabenh.) Lacout."]
[85084,"sp","Cephaloziella integerrima (Lindb.) Warnst."]
[85085,"sp","Cephaloziella massalongi (Spruce) Müll.Frib."]
[85086,"sp","Cephaloziella phyllacantha (C.Massal. & Carestia) Müll.Frib."]
[85087,"sp","Cephaloziella spinigera (Lindb.) Jørg."]
[85088,"sp","Cephaloziella stellulifera (Carrington & Pearson) Croz."]
[85089,"sp","Cephaloziella varians (Gottsche) Steph."]
[85090,"aggr","Cephaloziella rubella aggr."]
[85091,"sp","Cephaloziella elegans (Heeg) Schiffn."]
[85092,"sp","Cephaloziella hampeana (Nees) Loeske"]
[85093,"sp","Cephaloziella rubella (Nees) Warnst."]
[85008,"genus","Anastrepta (Lindb.) Schiffn."]
[85009,"sp","Anastrepta orcadensis (Hook.) Schiffn."]
[85010,"genus","Anastrophyllum (Spruce) Steph."]
[85011,"sp","Anastrophyllum assimile (Mitt.) Steph."]
[85012,"sp","Anastrophyllum hellerianum (Lindenb.) R.M.Schust."]
[85013,"sp","Anastrophyllum minutum (Schreb.) R.M.Schust."]
[85014,"subsp","Anastrophyllum minutum (Schreb.) R.M.Schust. subsp. minutum"]
[85031,"genus","Barbilophozia Loeske"]
{"$rows_left_out":1547}
{"sheet":"Substrat","index":6,"n_rows":339,"n_cols":6,"rows_kept":339,"cut":false,"hidden":false,"merged":[]}
["TEXT_D","CODE_SWISSLICHENS","KUERZEL",null,"TEXT_F","TEXT_I"]
["Borke eines Baumes",302,"e1","e1 : Borke eines Baumes","écorce d'un arbre","corteccia di un albero"]
["Borke eines Strauchs",9,"e2","e2 : Borke eines Strauchs","écorce d' un arbuste","corteccia di Cespuglio"]
["Borke eines Zwergstrauchs",224,"e3","e3 : Borke eines Zwergstrauchs","écorce d'un arbrisseau nain","corteccia di Cespuglio nano"]
["Borke eines Nadelbaums",49,"e4","e4 : Borke eines Nadelbaums","écorce d'un conifère","corteccia di un aghifoglia"]
["Borke eines Laubbaums",99,"e5","e5 : Borke eines Laubbaums","écorce d'un feuillu","corteccia di Latifoglia"]
["Borke eines Obstbaum",242,"e6","e6 : Borke eines Obstbaum","écorce d'un arbre fruitier","corteccia di un albero da frutta"]
["Abies alba (Borke)",11,"e10","e10 : Borke von Abies alba","écorce d' Abies alba","corteccia di Abies alba"]
["Abies excelsior (Borke)",234,"e11","e11 : Borke von Abies excelsior","écorce de Abies excelsior","corteccia di Abies excelsior"]
["Abies sp. (Borke)",30,"e12","e12 : Borke von Abies sp.","écorce d' Abies sp.","corteccia di Abies sp."]
["Acer campestre (Borke)",56,"e13","e13 : Borke von Acer campestre","écorce de Acer campestre","corteccia di Acer campestre"]
["Acer opalus (Borke)",59,"e14","e14 : Borke von Acer opalus","écorce d' Acer opalus","corteccia di Acer opalus"]
["Acer platanoides (Borke)",57,"e15","e15 : Borke von Acer platanoides","écorce d' Acer platanoides","corteccia di Acer platanoides"]
["Acer pseudoplatanus (Borke)",58,"e16","e16 : Borke von Acer pseudoplatanus","écorce d' Acer pseudoplatanus","corteccia di Acer pseudoplatanus"]
["Acer sp. (Borke)",202,"e17","e17 : Borke von Acer sp.","écorce d' Acer sp.","corteccia di Acer sp."]
["Aesculus hippocastanum (Borke)",89,"e18","e18 : Borke von Aesculus hippocastanum","écorce d' Aesculus hippocastanum","corteccia di Aesculus hippocastanum"]
["Alnus glutinosa (Borke)",63,"e19","e19 : Borke von Alnus glutinosa","écorce d' Alnus glutinosa","corteccia di Alnus glutinosa"]
["Alnus incana (Borke)",64,"e20","e20 : Borke von Alnus incana","écorce d' Alnus incana","corteccia di Alnus incana"]
["Alnus sp. (Borke)",204,"e21","e21 : Borke von Alnus sp.","écorce d' Alnus sp.","corteccia di Alnus sp."]
["Alnus viridis (Borke)",5,"e22","e22 : Borke von Alnus viridis","écorce d' Alnus viridis","corteccia di Alnus viridis"]
["Amelanchier ovalis (Borke)",102,"e23","e23 : Borke von Amelanchier ovalis","écorce d' Amelanchier ovalis","corteccia di Amelanchier ovalis"]
["Arctostaphylos uva-ursi (Borke)",129,"e24","e24 : Borke von Arctostaphylos uva-ursi","écorce d' Arctostaphylos uva-ursi","corteccia di Arctostaphylos uva-ursi"]
["Berberis vulgaris (Borke)",100,"e25","e25 : Borke von Berberis vulgaris","écorce de Berberis vulgaris","corteccia di Berberis vulgaris"]
["Betula alba (Borke)",244,"e26","e26 : Borke von Betula alba","écorce de Betula alba","corteccia di Betula alba"]
["Betula pendula (Borke)",65,"e27","e27 : Borke von Betula pendula","écorce de Betula pendula","corteccia di Betula pendula"]
["Betula pubescens (Borke)",66,"e28","e28 : Borke von Betula pubescens","écorce de Betula pubescens","corteccia di Betula pubescens"]
["Betula sp. (Borke)",205,"e29","e29 : Borke von Betula sp.","écorce de Betula sp.","corteccia di Betula sp."]
["Buxus sempervirens (Borke)",101,"e30","e30 : Borke von Buxus sempervirens","écorce de Buxus sempervirens","corteccia di Buxus sempervirens"]
["Calluna sp. (Borke)",228,"e31","e31 : Borke von Calluna sp.","écorce de Calluna sp.","corteccia di Calluna sp."]
["Carpinus betulus (Borke)",67,"e32","e32 : Borke von Carpinus betulus","écorce de Carpinus betulus","corteccia di Carpinus betulus"]
["Castanea sativa (Borke)",62,"e33","e33 : Borke von Castanea sativa","écorce de Castanea sativa","corteccia di Castanea sativa"]
["Cedrus sp. (Borke)",31,"e34","e34 : Borke von Cedrus sp.","écorce de Cedrus sp.","corteccia di Cedrus sp."]
["Celtis australis (Borke)",68,"e35","e35 : Borke von Celtis australis","écorce de Celtis australis","corteccia di Celtis australis"]
["Chamaecyparis sp. (Borke)",32,"e36","e36 : Borke von Chamaecyparis sp.","écorce de Chamaecyparis sp.","corteccia di Chamaecyparis sp."]
["Clematis vitalba (Borke)",124,"e37","e37 : Borke von Clematis vitalba","écorce de Clematis vitalba","corteccia di Clematis vitalba"]
["Cornus mas (Borke)",105,"e38","e38 : Borke von Cornus mas","écorce de Cornus mas","corteccia di Cornus mas"]
["Cornus sanguinea (Borke)",104,"e39","e39 : Borke von Cornus sanguinea","écorce de Cornus sanguinea","corteccia di Cornus sanguinea"]
["Corylus avellana (Borke)",106,"e40","e40 : Borke von Corylus avellana","écorce de Corylus avellana","corteccia di Corylus avellana"]
["Crataegus sp. (Borke)",118,"e41","e41 : Borke von Crataegus sp.","écorce de Crataegus sp.","corteccia di Crataegus sp."]
["Crinalis sp. (Borke)",236,"e42","e42 : Borke von Crinalis sp.","écorce de Crinalis sp.","corteccia di Crinalis sp."]
["Cryptomeria sp. (Borke)",33,"e43","e43 : Borke von Cryptomeria sp.","écorce de Cryptomeria sp.","corteccia di Cryptomeria sp."]
["Cydonia oblonga (Borke)",300,"e44","e44 : Borke von Cydonia oblonga","écorce de Cydonia oblonga","corteccia di Cydonia oblonga"]
["Daphne mezereum (Borke)",247,"e45","e45 : Borke von Daphne mezereum","écorce de Daphne mezereum","corteccia di Daphne mezereum"]
["Evonymus sp. (Borke)",111,"e46","e46 : Borke von Evonymus sp.","écorce de Evonymus sp.","corteccia di Evonymus sp."]
["Fagus sylvatica (Borke)",50,"e47","e47 : Borke von Fagus sylvatica","écorce de Fagus sylvatica","corteccia di Fagus sylvatica"]
["Fraxinus excelsior (Borke)",60,"e48","e48 : Borke von Fraxinus excelsior","écorce de Fraxinus excelsior","corteccia di Fraxinus excelsior"]
["Fraxinus ornus (Borke)",61,"e49","e49 : Borke von Fraxinus ornus","écorce de Fraxinus ornus","corteccia di Fraxinus ornus"]
["Fraxinus sp. (Borke)",203,"e50","e50 : Borke von Fraxinus sp.","écorce de Fraxinus sp.","corteccia di Fraxinus sp."]
["Hedera helix (Borke)",123,"e51","e51 : Borke von Hedera helix","écorce de Hedera helix","corteccia di Hedera helix"]
["Hippophae rhamnoides (Borke)",113,"e52","e52 : Borke von Hippophae rhamnoides","écorce de Hippophae rhamnoides","corteccia di Hippophae rhamnoides"]
["Ilex aquifolium (Borke)",6,"e53","e53 : Borke von Ilex aquifolium","écorce de Ilex aquifolium","corteccia di Ilex aquifolium"]
["Juglans regia (Borke)",69,"e54","e54 : Borke von Juglans regia","écorce de Juglans regia","corteccia di Juglans regia"]
["Juglans sp. (Borke)",206,"e55","e55 : Borke von Juglans sp.","écorce de Juglans sp.","corteccia di Juglans sp."]
["Juniperus communis (Borke)",2,"e56","e56 : Borke von Juniperus communis","écorce de Juniperus communis","corteccia di Juniperus communis"]
["Juniperus sp. (Borke)",226,"e57","e57 : Borke von Juniperus sp.","écorce de Juniperus sp.","corteccia di Juniperus sp."]
["Laburnum anagyroides (Borke)",7,"e58","e58 : Borke von Laburnum anagyroides","écorce de Laburnum anagyroides","corteccia di Laburnum anagyroides"]
["Larix decidua (Borke)",20,"e59","e59 : Borke von Larix decidua","écorce de Larix decidua","corteccia di Larix decidua"]
["Ligustrum vulgare (Borke)",110,"e60","e60 : Borke von Ligustrum vulgare","écorce de Ligustrum vulgare","corteccia di Ligustrum vulgare"]
["Liriodendron tulipifera (Borke)",90,"e61","e61 : Borke von Liriodendron tulipifera","écorce de Liriodendron tulipifera","corteccia di Liriodendron tulipifera"]
["Lonicera sp. (Borke)",103,"e62","e62 : Borke von Lonicera sp.","écorce de Lonicera sp.","corteccia di Lonicera sp."]
{"$rows_left_out":280}
{"sheet":"Substrat_M","index":7,"n_rows":20,"n_cols":2,"rows_kept":20,"cut":false,"hidden":false,"merged":[[0,0,0,1]]}
["Substratliste Moose"]
[]
["Code","Text"]
["a","Wasser"]
["b","Schlamm"]
["c","feuchte bis nasse Erde"]
["d","frische bis trockene Erde"]
["e","Rohhumus oder Torf"]
["f","Totholz"]
["g","lebende Bäume"]
["h","über anderen Moosen"]
["i","nährstoffreiches, organisches Material"]
["j","Kalktuff"]
["k","Gesteinsrohboden, kalkreich"]
["l","Gesteinsrohboden, kalkarm"]
["m","kalkhaltiges Gestein, trocken"]
["n","kalkhaltiges Gestein, feuht"]
["o","kalkhaltiges Gestein, trocken"]
["p","kalkhaltiges Gestein, feucht"]
["q","weitere Substrate"]